cis-furan Linalool oxide

Normal alkane RI, polar column, custom temperature program

Data compiled by: NIST Mass Spectrometry Data Center, William E. Wallace, director

Column type CapillaryCapillary
Active phase CP-Wax 52 CBCP-Wax 52 CB
Column length (m) 50.50.
Carrier gas HeliumHelium
Substrate
Column diameter (mm) 0.250.25
Phase thickness (μm) 0.200.20
Program 60 0C (5 min) 3 0C/min -> 250 0C (20 min) 1 0C/min -> 255 0C60 0C (5 min) 3 0C/min -> 250 0C (20 min) 1 0C/min -> 255 0C
I 1464.1467.
ReferenceGenisheva and Oliveira, 2009Genisheva and Oliveira, 2009
Comment MSDC-RI MSDC-RI

References

Genisheva and Oliveira, 2009
Genisheva, Z.; Oliveira, J.M., Monoterpenic characterization of white cultivars from Vinhos Verdes appelation of origin (North Portugal), J. Inst. Brewing, 2009, 115, 4, 308-317, https://doi.org/10.1002/j.2050-0416.2009.tb00386.x . [all data]