(E)-Pinocarveol

Normal alkane RI, non-polar column, temperature ramp

View large format table.

Column type Active phase I Reference Comment
CapillarySE-541135.Dayisoylu and Alma, 200930. m/0.25 mm/0.25 μm, Helium, 60. C @ 5. min, 2. K/min, 260. C @ 999. min

References

Dayisoylu and Alma, 2009
Dayisoylu, K.S.; Alma, M.H., Chemical analysis of essential oils from cone's rosin of Cilician fir (Abies cilicica subsp. cilicica), Afr. J. Biotechnol., 2009, 8, 15, 3502-3505. [all data]