1,10-di-epi-Cubenol

Normal alkane RI, non-polar column, temperature ramp

Data compiled by: NIST Mass Spectrometry Data Center, William E. Wallace, director

Column type CapillaryCapillaryCapillaryCapillary
Active phase HP-5 MSDB-5HP-5HP-5 MS
Column length (m) 30.30.30.30.
Carrier gas HeliumHeliumHeliumHelium
Substrate
Column diameter (mm) 0.250.250.250.25
Phase thickness (μm) 0.250.250.250.25
Tstart (C) 50.50.50.100.
Tend (C) 180.250.240.220.
Heat rate (K/min) 2.2.3.2.
Initial hold (min)   5.
Final hold (min)
I 1615.1619.1619.1611.
ReferenceHammami, Kamoun, et al., 2011Ho, Wang, et al., 2010Monsef-Esfahani, Miri, et al., 2010Pripdeevech, Chumpolsri, et al., 2010
Comment MSDC-RI MSDC-RI MSDC-RI MSDC-RI

Normal alkane RI, non-polar column, custom temperature program

Data compiled by: NIST Mass Spectrometry Data Center, William E. Wallace, director

Column type CapillaryCapillaryCapillaryCapillaryCapillary
Active phase 5 % Phenyl polydimethyl siloxaneHP-5HP-5HP-5HP-5
Column length (m)  25.25.25.25.
Carrier gas  HeliumHeliumHeliumHelium
Substrate
Column diameter (mm)  0.320.320.320.32
Phase thickness (μm)  0.170.170.170.17
Program not specified60 0C (5 min) 4 0C/min -> 220 0C 11 0C/min -> 280 0C (15 min)60 0C (5 min) 4 0C/min -> 220 0C 11 0C/min -> 280 0C (15 min)not specifiednot specified
I 1616.1611.1621.1619.1619.
ReferenceChaverri, Diaz, et al., 2011Custer, 2009Custer, 2009Custer, 2009Custer, 2009
Comment MSDC-RI MSDC-RI MSDC-RI MSDC-RI MSDC-RI

References

Hammami, Kamoun, et al., 2011
Hammami, I.; Kamoun, N.; Rebai, A., Biocontrol of Botrytis cinerea with essential oil and methanol extract of Viola odorata flowers, Archives of Appl. Sci. Res., 2011, 3, 5, 44-51. [all data]

Ho, Wang, et al., 2010
Ho, C.-L.; Wang, E.I.-C.; Yu, H.-T.; Yu, H.-M.; Su, Y.-C., Composition amd antioxidant activities of essential oils of different tissues from Cryptomeria japonica D. Don, Quarterly J. Chin. Forestry, 2010, 32, 1, 63-76. [all data]

Monsef-Esfahani, Miri, et al., 2010
Monsef-Esfahani, H.R.; Miri, A.; Amini, M.; Amanzadeh, Y.; Hadjiakhoondi, A.; Hajiaghaee, R.; Ajani, Y., Seasonal variations in the chemical composition, antioxidant activity and total phenolic content of Teucrium persicum Boiss. essential oils, Res. J. Biol. Sci., 2010, 5, 7, 492-498, https://doi.org/10.3923/rjbsci.2010.492.498 . [all data]

Pripdeevech, Chumpolsri, et al., 2010
Pripdeevech, P.; Chumpolsri, W.; Suttiarporn, P.; Wongpornchai, S., The chemical composition and antioxidant activities of Basil from Thailand using retention indices and comprehensive two-dimensional gas chromatography, J. Seb. Chem. Soc., 2010, 75, 11, 1503-1513, https://doi.org/10.2298/JSC100203125P . [all data]