1-(methylthio)ethanethiol

Normal alkane RI, non-polar column, temperature ramp

Data compiled by: NIST Mass Spectrometry Data Center, William E. Wallace, director

Column type CapillaryCapillary
Active phase DB-1HG-5
Column length (m) 60.50.
Carrier gas HeHe
Substrate
Column diameter (mm) 0.320.32
Phase thickness (μm) 0.250.52
Tstart (C) 60.35.
Tend (C) 220.250.
Heat rate (K/min) 3.3.
Initial hold (min)  15.
Final hold (min)  45.
I 826.854.
ReferenceGüntert, Bertram, et al., 1992Drumm and Spanier, 1991
Comment MSDC-RI MSDC-RI

References

Güntert, Bertram, et al., 1992
Güntert, M.; Bertram, H.-J.; Hopp, R.; Silberzahn, W.; Sommer, H.; Werkhoff, P., Thermal generation of flavor compounds from thiamin and various amino acids in Recent developments in flavor and fragrance chemistry. Proceedings of the 3rd International Haarmann Reimer Symposium, Hopp,R.; Mori,K., ed(s)., VCH Publishers, New York, 1992, 215-240. [all data]

Drumm and Spanier, 1991
Drumm, T.D.; Spanier, A.M., Changes in the content of lipid autoxidation and sulfur-containing compounds in cooked beef during storage, J. Agric. Food Chem., 1991, 39, 2, 336-343, https://doi.org/10.1021/jf00002a023 . [all data]