4-Methyl-5,6-dihydropyran-2-one
- Formula: C6H6O2
- Molecular weight: 110.1106
- IUPAC Standard InChIKey: FINYGTPXELVTLO-UHFFFAOYSA-N
- Chemical structure:

Normal alkane RI, polar column, custom temperature program

Column type | Active phase | I | Reference | Comment |
---|---|---|---|---|
Capillary | Stabilwax | 2027. | Chinnici, Guerrero, et al., 2009 | 30. m/0.25 mm/0.25 μm, Helium; Program: 35 0C 3 0C/min -> 100 0C 5 0C/min -> 240 0C (10 min) |

References

Chinnici, Guerrero, et al., 2009
Chinnici, F.; Guerrero, E.D.; Sonni, F.; Natali, N.; Marin, R.N.; Riponi, C.,
Gas chromatography - mass spectrometry (GC-MS) characterization of volatile compounds in quality vinegars with protected Europian geographical indication,
J. Agric. Food Chem., 2009, 57, 11, 4784-4792, https://doi.org/10.1021/jf804005w
. [all data]