trans-Sabinol

Normal alkane RI, non-polar column, custom temperature program

Data compiled by: NIST Mass Spectrometry Data Center, William E. Wallace, director

Column type CapillaryCapillary
Active phase DB-1HP-5
Column length (m) 30.30.
Carrier gas HydrogenNitrogen
Substrate
Column diameter (mm) 0.250.35
Phase thickness (μm) 0.250.25
Program 45 0C 3 0C/min -> 175 0C 15 0C/min -> 300 0C (10 min)60 0C 3 0C/min -> 210 0C 5 0C/min -> 250 0C (2 min)
I 1101.1147.
ReferenceAlbano, Lima, et al., 2012Veres, Csupor-Loffler, et al., 2012
Comment MSDC-RI MSDC-RI

Normal alkane RI, non-polar column, temperature ramp

Data compiled by: NIST Mass Spectrometry Data Center, William E. Wallace, director

Column type CapillaryCapillary
Active phase Optima-5HP-5 MS
Column length (m) 30.30.
Carrier gas HeliumHelium
Substrate
Column diameter (mm) 0.250.25
Phase thickness (μm) 0.250.25
Tstart (C) 60.40.
Tend (C) 246.250.
Heat rate (K/min) 3.3.
Initial hold (min) 1.1.
Final hold (min)  3.
I 1137.1139.
ReferenceAl-Qudah, Muhaidat, et al., 2012Jian-Yu, Zhu, et al., 2012
Comment MSDC-RI MSDC-RI

References

Albano, Lima, et al., 2012
Albano, S.M.; Lima, A.S.; Miguel, M.G.; Pedro, L.G.; Barroso, J.G.; Figueiredo, A.C., Antioxidant, anti-5-lipoxygenase and antiacetylcholinesterase activities of essential oils and decoction water of some aromatic plants, Rec. Nat. Prod., 2012, 6, 1, 35-48. [all data]

Veres, Csupor-Loffler, et al., 2012
Veres, K.; Csupor-Loffler, B.; Lazar, A.; Holmann, J., Antifungal activity and composition of essential oils of Conyza canadensis herbs and roots, The Sci. World. J., 2012, 2012, 1-5, https://doi.org/10.1100/2012/489646 . [all data]