3-Sulfanylpropyl acetate

Normal alkane RI, non-polar column, custom temperature program

Data compiled by: NIST Mass Spectrometry Data Center, William E. Wallace, director

Column type CapillaryCapillary
Active phase CP-Sil 5 CBCP-Sil 5 CB
Column length (m) 50.50.
Carrier gas NitrogenNitrogen
Substrate
Column diameter (mm) 0.320.32
Phase thickness (μm) 1.201.20
Program 36 0C 20 0C/min -> 85 0C 1 0C/min -> 145 0C 3 0C/min -> 250 0C (30 min)36 0C 20 0C/min -> 85 0C 1 0C -> 145 0C 3 0C/min -> 250 0C
I 1000.989.
ReferenceGros, Nizet, et al., 2011Bailly, Jerkovic, et al., 2009
Comment MSDC-RI MSDC-RI

References

Gros, Nizet, et al., 2011
Gros, J.; Nizet, S.; Collin, S., Occurence of odorant polyfunctional thiols in the Super Alpha Tomahawk Hop cultivar. Comparison with the thiol-rich Nelson Sauvin bitter variety, J. Agric. Food Chem., 2011, 59, 16, 8853-8865, https://doi.org/10.1021/jf201294e . [all data]

Bailly, Jerkovic, et al., 2009
Bailly, S.; Jerkovic, V.; Meuree, A.; Timmermans, A.; Collin, S., Fate of key odorants in Sauternes wines through aging, J. Agric. Food Chem., 2009, 57, 18, 8557-8563, https://doi.org/10.1021/jf901429d . [all data]