3-Methyl-3-sulfanylbutanal

Normal alkane RI, non-polar column, custom temperature program

View large format table.

Column type Active phase I Reference Comment
CapillaryCP Sil-5 CB845.Bailly and Collin, 201050. m/0.32 mm/1.20 μm, Nitrogen; Program: 36 0C 20 0C/min -> 85 0C 1 0C/min -> 145 0C 3 0C/min -> 250 0C
CapillaryCP-Sil 5 CB842.Bailly, Jerkovic, et al., 200950. m/0.32 mm/1.20 μm, Nitrogen; Program: 36 0C 20 0C/min -> 85 0C 1 0C -> 145 0C 3 0C/min -> 250 0C

Normal alkane RI, polar column, custom temperature program

View large format table.

Column type Active phase I Reference Comment
CapillaryFFAP1653.Bailly and Collin, 201025. m/0.32 mm/0.30 μm, Nitrogen; Program: 36 0C 20 0C/min -> 85 0C 1 0C/min -> 145 0C 3 0C/min -> 250 0C
CapillaryFFAP1653.Bailly, Jerkovic, et al., 200925. m/0.32 mm/0.30 μm, Nitrogen; Program: 36 0C 20 0C/min -> 85 0C 1 0C -> 145 0C 3 0C/min -> 230 0C

References

Bailly and Collin, 2010
Bailly, S.; Collin, S., Fate of polyunsaturated thiols in sauternes wines through ageing in Expression of Multidisciplinary Flavour Sci., Blank, I.; Wust, M.; Yertzian, C., ed(s)., Zhaw Ed., 2010, 227-230, retrieved from https://home.zhaw.ch/tildayere/pdf/Teil58-Expression of Multidisciplinary.pdf. [all data]

Bailly, Jerkovic, et al., 2009
Bailly, S.; Jerkovic, V.; Meuree, A.; Timmermans, A.; Collin, S., Fate of key odorants in Sauternes wines through aging, J. Agric. Food Chem., 2009, 57, 18, 8557-8563, https://doi.org/10.1021/jf901429d . [all data]