γ-Cadinol

Normal alkane RI, non-polar column, custom temperature program

View large format table.

Column type Active phase I Reference Comment
Capillary 1658.Karimi, Farmany, et al., 2011Program: not specified
CapillaryHP-51642.Wang, Liu, et al., 201130. m/0.25 mm/0.25 μm, Helium; Program: 60 0C (1 min) 10 0C/min -> 180 0C (1 min) 20 0C/min -> 280 0C (15 min)
CapillaryRTX-51654.Zachariah, Leela, et al., 200830. m/0.25 mm/0.25 μm, Helium; Program: 60 0C (5 min) 5 0C/min -> 110 0C 3 0C/min -> 220 0C (5 min)
CapillaryRTX-51654.Zachariah, Leela, et al., 200830. m/0.25 mm/0.25 μm, Helium; Program: not specified

References

Karimi, Farmany, et al., 2011
Karimi, H.; Farmany, A.; Noorizadeh, H., Prediction of linear retention index of Teucrium chamaedrys volatiles in GCxGC-TOF/MS by linear model, World Appl. Sci. J., 2011, 15, 8, 1086-1088. [all data]

Wang, Liu, et al., 2011
Wang, C.F.; Liu, P.; Yang, K.; Zeng, Y.; Liu, Z.L.; Du, S.S.; Deng, Z.W., Chemical composition and toxicities of essential oil of Illicium fragesil fruits against Sitophilis zeamais, African J. Biotechnol., 2011, 10, 79, 18179-18184. [all data]

Zachariah, Leela, et al., 2008
Zachariah, T.J.; Leela, N.K.; Maya, K.M.; Rema, J.; Mathew, P.A.; Vipin, T.M.; Krishnamoorthy, B., Chemical composition of leaf oils of Myristica beddomeii (King), Myristica fragrans (Houtt.) and Myristica malabarica (Lamk.), J. Spices Arom. Crops, 2008, 17, 1, 10-15. [all data]