Longiborneol acetate
- Formula: C17H28O2
- Molecular weight: 264.4030
- IUPAC Standard InChIKey: NVBYJWWRRWURRN-FECYRMIVSA-N
- Chemical structure:

Normal alkane RI, non-polar column, temperature ramp

Column type | Active phase | I | Reference | Comment |
---|---|---|---|---|
Capillary | DB-5 | 1687. | Mosayebi, Amin, et al., 2008 | 60. m/0.25 mm/0.25 μm, Nitrogen, 5. K/min, 250. C @ 10. min; Tstart: 60. C |

References

Mosayebi, Amin, et al., 2008
Mosayebi, M.; Amin, G.; Arzani, H.; Azarnivand, H.; Maleki, M.; Shafaghat, A.,
Effect of habitat on essential oil of Achillea filipendula L. in Iran,
Asian J. Plant Sci., 2008, 7, 8, 779-781, https://doi.org/10.3923/ajps.2008.779.781
. [all data]