Gossonorol

Normal alkane RI, non-polar column, temperature ramp

View large format table.

Column type Active phase I Reference Comment
CapillaryCP Sil 5 CB1637.Usman, Zubair, et al., 201025. m/0.25 mm/0.15 μm, 3. K/min; Tstart: 50. C; Tend: 230. C
CapillaryDB-51653.Mosayebi, Amin, et al., 200860. m/0.25 mm/0.25 μm, Nitrogen, 5. K/min, 250. C @ 10. min; Tstart: 60. C

References

Usman, Zubair, et al., 2010
Usman, L.A.; Zubair, M.F.; Adabayo, S.A.; Oladosu, I.A.; Muhammad, N.O.; Akolade, J.O., Chemical composition of leaf and fruit essential oils of Hoslundia opposita Vahl grown in Nigeria, Americal-Eurasian J. Agric. Environ. Sci., 2010, 8, 1, 40-43. [all data]

Mosayebi, Amin, et al., 2008
Mosayebi, M.; Amin, G.; Arzani, H.; Azarnivand, H.; Maleki, M.; Shafaghat, A., Effect of habitat on essential oil of Achillea filipendula L. in Iran, Asian J. Plant Sci., 2008, 7, 8, 779-781, https://doi.org/10.3923/ajps.2008.779.781 . [all data]