Isoascaridole

Normal alkane RI, non-polar column, temperature ramp

View large format table.

Column type Active phase I Reference Comment
CapillaryBP-11283.Ottavioli, Bighelli, et al., 200950. m/0.22 mm/0.25 μm, Helium, 2. K/min, 220. C @ 20. min; Tstart: 60. C
CapillaryDB-51317.Mosayebi, Amin, et al., 200860. m/0.25 mm/0.25 μm, Nitrogen, 5. K/min, 250. C @ 10. min; Tstart: 60. C

Normal alkane RI, non-polar column, custom temperature program

View large format table.

Column type Active phase I Reference Comment
CapillaryHP-5 MS1295.Bai, Liu, et al., 201130. m/0.25 mm/0.25 μm, Helium; Program: 60 0C (1 min) 10 0C/min -> 180 0C (1 min) 20 0C/min -> 280 0C (15 min)

Normal alkane RI, polar column, temperature ramp

View large format table.

Column type Active phase I Reference Comment
CapillaryBP-201853.Ottavioli, Bighelli, et al., 200950. m/0.22 mm/0.25 μm, Helium, 2. K/min, 220. C @ 20. min; Tstart: 60. C

References

Ottavioli, Bighelli, et al., 2009
Ottavioli, J.; Bighelli, A.; Casanova, J.; Bang, B.T.; Y., GC (retention indices), GC-MS, and 13C NMR of two citral-rich Cymbopogon leaf oils: C. Flexuosus and C. tortilis, Spectroscopy Lett., 2009, 42, 8, 506-512, https://doi.org/10.1080/00387010903022350 . [all data]

Mosayebi, Amin, et al., 2008
Mosayebi, M.; Amin, G.; Arzani, H.; Azarnivand, H.; Maleki, M.; Shafaghat, A., Effect of habitat on essential oil of Achillea filipendula L. in Iran, Asian J. Plant Sci., 2008, 7, 8, 779-781, https://doi.org/10.3923/ajps.2008.779.781 . [all data]

Bai, Liu, et al., 2011
Bai, C.Q.; Liu, Z.L.; Liu, Q.Z., Nematicidal constituents from the essential oil of Chenopodium ambrosioides aerial parts, E-Journal of Chemistry, 2011, 8, S1, s143-s148, https://doi.org/10.1155/2011/470862 . [all data]