Intermedeol

Normal alkane RI, non-polar column, temperature ramp

Data compiled by: NIST Mass Spectrometry Data Center, William E. Wallace, director

Column type CapillaryCapillaryCapillary
Active phase HP-5 MSHP-5DB-5
Column length (m) 30.30.60.
Carrier gas HeliumHeliumNitrogen
Substrate
Column diameter (mm) 0.250.320.25
Phase thickness (μm) 0.250.250.25
Tstart (C) 50.60.60.
Tend (C) 180.240.250.
Heat rate (K/min) 2.3.5.
Initial hold (min)  2.
Final hold (min)   10.
I 1666.1669.1675.
ReferencePhungpanya, Thongpoon, et al., 2012Kahriman, Tosun, et al., 2010Mosayebi, Amin, et al., 2008
Comment MSDC-RI MSDC-RI MSDC-RI

References

Phungpanya, Thongpoon, et al., 2012
Phungpanya, C.; Thongpoon, C.; Pripdeevech, P.; Machan, T., Analysis of aroma volatiles from fresh leaves of Plectranthus amboinicus using solid phase microextraction (SPME) technique, Pure and Applied Chemistry International Conference 2012 (PACCON 2012), 2012, 16701672. [all data]

Kahriman, Tosun, et al., 2010
Kahriman, N.; Tosun, G.; Genc, H.; Yayli, N., Comparative essential oil analysis of Geranium sylvaticum estracted by hydrodistillation and microwave distillation, Turk. J. Chem., 2010, 34, 969-976. [all data]

Mosayebi, Amin, et al., 2008
Mosayebi, M.; Amin, G.; Arzani, H.; Azarnivand, H.; Maleki, M.; Shafaghat, A., Effect of habitat on essential oil of Achillea filipendula L. in Iran, Asian J. Plant Sci., 2008, 7, 8, 779-781, https://doi.org/10.3923/ajps.2008.779.781 . [all data]