Heptatricosane, 15-methyl

Normal alkane RI, non-polar column, custom temperature program

Data compiled by: NIST Mass Spectrometry Data Center, William E. Wallace, director

Column type Capillary
Active phase DB-5
Column length (m) 30.
Carrier gas Helium
Substrate
Column diameter (mm) 0.25
Phase thickness (μm) 0.25
Program 60 0C (2 min) 60 0C/min -> 200 0C 4 0C/min -> 320 0C (10 min)
I 3731.
ReferenceMenzel, Bluthgen, et al., 2008
Comment MSDC-RI

References

Menzel, Bluthgen, et al., 2008
Menzel, F.; Bluthgen, N.; Schmitt, T., Tropical parabiotic ants: Highly unusual cuticular substances and low interspecific discrimination, Frontiers in Zoology, 2008, 5, 16, 1-16. [all data]