14-Heptatricosene

Normal alkane RI, non-polar column, custom temperature program

View large format table.

Column type Active phase I Reference Comment
CapillaryDB-53672.Menzel, Bluthgen, et al., 200830. m/0.25 mm/0.25 μm, Helium; Program: 60 0C (2 min) 60 0C/min -> 200 0C 4 0C/min -> 320 0C (10 min)

References

Menzel, Bluthgen, et al., 2008
Menzel, F.; Bluthgen, N.; Schmitt, T., Tropical parabiotic ants: Highly unusual cuticular substances and low interspecific discrimination, Frontiers in Zoology, 2008, 5, 16, 1-16. [all data]