4-Mercapto-4-methylpentan-2-one

Normal alkane RI, non-polar column, custom temperature program

View large format table.

Column type Active phase I Reference Comment
CapillaryCP-Sil 5 CB915.Liu, Cao, et al., 2009Column length: 50. m; Column diameter: 0.32 mm; Program: not specified

Normal alkane RI, polar column, custom temperature program

View large format table.

Column type Active phase I Reference Comment
CapillaryDB-Wax1377.Kisumoto, Kobayashi, et al., 200830. m/0.25 mm/0.25 μm, Helium; Program: 40 0C (15 min) 5 0C/min -> 160 0C (16 min) 10 0C/min -> 230 0C (7 min)

References

Liu, Cao, et al., 2009
Liu, F.; Cao, C.; Li, X., Quantitative structure-retention relationship study of mercapto-compounds by the method of dividing the molecular structure into substructure, QSAR Comb. Sci., 2009, 28, 11-12, 1358-1366, https://doi.org/10.1002/qsar.200960043 . [all data]

Kisumoto, Kobayashi, et al., 2008
Kisumoto, T.; Kobayashi, M.; Yako, N.; Iida, A.; Wanikawa, A., Comparison of 4-mercapto-4-methylpentan-2-one contents in hop cultivars from different growing regions, J. Agric. Food Chem., 2008, 56, 3, 1051-1057, https://doi.org/10.1021/jf072173e . [all data]