2-Methyl-3-(methyldithio)furan

Normal alkane RI, non-polar column, temperature ramp

View large format table.

Column type Active phase I Reference Comment
CapillaryDB-51166.Shedid, 201030. m/0.25 mm/0.25 μm, Helium, 4. K/min; Tstart: 50. C; Tend: 220. C

Normal alkane RI, non-polar column, custom temperature program

View large format table.

Column type Active phase I Reference Comment
CapillaryDB-51170.San-Juan, Petka, et al., 201030. m/0.32 mm/0.50 μm, Hydrogen; Program: 40 0C (5 min) 4 0C/min -> 100 0C 6 0C/min -> 220 0C (20 min)

Normal alkane RI, polar column, custom temperature program

View large format table.

Column type Active phase I Reference Comment
CapillaryDB-Wax1668.San-Juan, Petka, et al., 201030. m/0.32 mm/0.50 μm, Hydrogen; Program: 40 0C (5 min) 4 0C/min -> 100 0C 6 0C/min -> 220 0C (20 min)
CapillaryFFAP1615.Frauendorfer and Schieberle, 2008Helium; Program: not specified

References

Shedid, 2010
Shedid, S., Chemical composition and antioxidant activity of Mallard reaction products generated from glutathione or Cysteine/glucose, World Appl. Sci. J., 2010, 9, 10, 1148-1154. [all data]

San-Juan, Petka, et al., 2010
San-Juan, F.; Petka, J.; Cacho, J.; Ferreira, V.; Escudero, A., Producing headspace extracts for the gas chromatography - olphactometric evaluation of wine aroma, Food Chemistry, 2010, 123, 1, 188-195, https://doi.org/10.1016/j.foodchem.2010.03.129 . [all data]

Frauendorfer and Schieberle, 2008
Frauendorfer, F.; Schieberle, P., Changes in key aroma compounds of criollo cocoa beans during roasting, J. Agric. Food Chem., 2008, 56, 21, 10244-10251, https://doi.org/10.1021/jf802098f . [all data]