9-epi-β-Caryophyllene

Normal alkane RI, non-polar column, temperature ramp

Data compiled by: NIST Mass Spectrometry Data Center, William E. Wallace, director

Column type CapillaryCapillary
Active phase DB-5DB-5 MS
Column length (m) 30.60.
Carrier gas HeliumHelium
Substrate
Column diameter (mm) 0.250.25
Phase thickness (μm) 0.250.25
Tstart (C) 60.40.
Tend (C) 240.250.
Heat rate (K/min) 3.5.
Initial hold (min)  15.
Final hold (min)  15.
I 1467.1471.
ReferenceKarimi, Farmani, et al., 2011Mesa-Arango, Betancur-Galvis, et al., 2010
Comment MSDC-RI MSDC-RI

References

Karimi, Farmani, et al., 2011
Karimi, H.; Farmani, A.; Nourizadeh, H., A performance comparison of modern statistical technique for molecular descriptor selection and retention prediction of essential oil from leaves, Amer. J. Sci. Res., 2011, 38, 36-40. [all data]

Mesa-Arango, Betancur-Galvis, et al., 2010
Mesa-Arango, A.C.; Betancur-Galvis, L.; Montiel, J.; Bueno, J.G.; Baena, A.; Duran, D.C.; Martinez, J.R.; Stashenko, E.E., Antifungal activity and chemical composition of the essential oils of Lippia alba (Miller) N.E. Brown grown in different regions of Colombia, J. Essential Oil Res., 2010, 22, 6, 568-574, https://doi.org/10.1080/10412905.2010.9700402 . [all data]