Isoverbanyl acetate

Normal alkane RI, non-polar column, custom temperature program

View large format table.

Column type Active phase I Reference Comment
CapillaryDB-51308.Pontes, de Oliveira, et al., 200730. m/0.25 mm/0.25 μm, Hydrogen; Program: 35 0C (2 min) 4 0C/min -> 180 0C 20 0C -> 280 0C

References

Pontes, de Oliveira, et al., 2007
Pontes, W.J.T.; de Oliveira, J.C.S.; da Camara, C.A.G.; Lopes, A.C.H.R.; Gondim, M.G.C.G.; de Oliveira, J.V.; Schwartz, M.O.E., Composition and acaricidal activity of the resin's essential oil of Protium bahianum Daly against two spotted spider mite (Tetranychus Urticae), J. Essent. Oil Res., 2007, 19, 4, 379-383, https://doi.org/10.1080/10412905.2007.9699310 . [all data]