α-Terpinolene

Normal alkane RI, non-polar column, temperature ramp

Data compiled by: NIST Mass Spectrometry Data Center, William E. Wallace, director

Column type CapillaryCapillaryCapillaryCapillaryCapillary
Active phase HP-1ZB-5RTx-1DB-1DB-5
Column length (m) 30.30.60.60.30.
Carrier gas HeliumNitrogenHeliumNitrogenHelium
Substrate
Column diameter (mm) 0.250.250.220.250.25
Phase thickness (μm) 0.250.250.250.250.25
Tstart (C) 60.40.60.60.40.
Tend (C) 240.200.230.250.240.
Heat rate (K/min) 3.5.2.5.3.
Initial hold (min)  5.  1.
Final hold (min)  5.35.
I 1083.1104.1082.1078.1063.
ReferenceAlizadeh and Shaabani, 2012Vazquez, Demmel, et al., 2011Dib, Bendahou, et al., 2010Meshkatalsadat, Safaei-Ghomi. J., et al., 2010de Souza, Lopes, et al., 2010
Comment MSDC-RI MSDC-RI MSDC-RI MSDC-RI MSDC-RI
Column type CapillaryCapillary
Active phase DB-1DB-1
Column length (m) 60.60.
Carrier gas NitrogenNitrogen
Substrate
Column diameter (mm) 0.250.25
Phase thickness (μm) 0.250.25
Tstart (C) 60.60.
Tend (C) 250.250.
Heat rate (K/min) 4.4.
Initial hold (min) 1.1.
Final hold (min) 10.10.
I 1063.1063.
ReferenceGhasempour, Shirinpour, et al., 2007Reza, Ebrahim, et al., 2007
Comment MSDC-RI MSDC-RI

Normal alkane RI, polar column, temperature ramp

Data compiled by: NIST Mass Spectrometry Data Center, William E. Wallace, director

Column type Capillary
Active phase HP-Innowax
Column length (m) 60.
Carrier gas Helium
Substrate
Column diameter (mm) 0.25
Phase thickness (μm) 0.25
Tstart (C) 60.
Tend (C) 220.
Heat rate (K/min) 5.
Initial hold (min) 1.
Final hold (min) 5.
I 1288.
ReferenceFeng, Cui, et al., 2011
Comment MSDC-RI

References

Alizadeh and Shaabani, 2012
Alizadeh, A.; Shaabani, M., Essential oil composition, phenolic content, antioxidant and antimicrobial activity in Salvia officinalis L. cultivated in Iran, Adv. Environ. Biol., 2012, 6, 1, 221-226. [all data]

Vazquez, Demmel, et al., 2011
Vazquez, A.M.; Demmel, G.I.; Criado, S.G.; Aimar, M.L.; Cantero, J.; Rossi, L.I.; Velasco, M.I., Phytochemistry of TAgetes minuta L. (Asteraceae) from Cordoba, Argentina: comparative study between essential oil and HS-SPME analyses, Boletin Latinoamericano y del Caribe Plantas Medicinales y Aromaticas, 2011, 10, 4, 351-362. [all data]

Dib, Bendahou, et al., 2010
Dib, M.A.; Bendahou, M.; Bendiabdellah, A.; Djabou, N.; Allali, H.; Tabti, B.; Paolini, J.; Costa, J., Partial chemical composition and antimicrobial activity of Daucus crinitus Desf. extracts, Grasas y Aceites, 2010, 61, 3, 271-278, https://doi.org/10.3989/gya.122609 . [all data]

Meshkatalsadat, Safaei-Ghomi. J., et al., 2010
Meshkatalsadat, M.H.; Safaei-Ghomi. J.; Moharramipour, S.; Nasseri, M., Chemical characterization of volatile components of Tagetes minuta L. cultivated in South West of Iran by nano scale injection, Digest J. Nanomaterials Biostructures, 2010, 5, 1, 101-106. [all data]

de Souza, Lopes, et al., 2010
de Souza, A.; Lopes, E.M.C.; da Silva, M.C.; Cordeiro, I.; Young, M.C.M.; Sobral, M.E.G.; Moreno, P.R.H., Chemical composition and acetylcholinesterase inhibitory activity of essential oils of Myrceugenia myrciolides (Cambess.) O. Berg and Eugenia riedelliana O. Berg, Myrtaceae, Braz. J. Pharmacognosy, 2010, 20, 2, 175-179. [all data]

Ghasempour, Shirinpour, et al., 2007
Ghasempour, H.R.; Shirinpour, E.; Heidari, H., The constituents of essential oils of Ferulago angulata (Schlecht.) Boiss at two different habitats, Nevakoh and Shahoo, Agross mountain, Western Iran, Iranian J. Sci. Technol., 2007, 31, A3, 309-312. [all data]

Reza, Ebrahim, et al., 2007
Reza, G.H.; Ebrahim, S.; Hossein, H., Analysis by gas chromatography - mass spectrometry of essential oil from seeds and aerial parts of Ferulago angulata (Schlecht.) Boiss gatheres in Nevakoh and Shahoo, Zagross mountain, west of Iran, Pakistan J. Biol. Sci., 2007, 10, 5, 814-817, https://doi.org/10.3923/pjbs.2007.814.817 . [all data]