Dihydroactinidioide

Normal alkane RI, non-polar column, custom temperature program

Data compiled by: NIST Mass Spectrometry Data Center, William E. Wallace, director

Column type Capillary
Active phase HP-5 MS
Column length (m) 30.
Carrier gas Hydrogen
Substrate
Column diameter (mm) 0.25
Phase thickness (μm) 0.25
Program 50 0C (15 min) 2 0C/min -> 150 0C (10 min) 2 0C/min -> 220 0C (20 min)
I 1568.
ReferenceChuang, Lee, et al., 2007
Comment MSDC-RI

References

Chuang, Lee, et al., 2007
Chuang, P.-H.; Lee, C.-W.; Chou, J.-Y.; Murugan, M.; Shieh, B.-J.; Chen, H.-M., Anti-fungal activity of crude extracts and essential oil of Moringa oleifera Lam, Bioresource Technol., 2007, 98, 1, 232-236, https://doi.org/10.1016/j.biortech.2005.11.003 . [all data]