Maltose, MEOX-8TMS

Normal alkane RI, non-polar column, custom temperature program

Data compiled by: NIST Mass Spectrometry Data Center, William E. Wallace, director

Column type Capillary
Active phase RTx-5 Sil MS
Column length (m) 30.
Carrier gas Helium
Substrate
Column diameter (mm) 0.25
Phase thickness (μm) 0.25
Program 70 0C (1 min) 1 0C/min -> 76 0C 6.09 0C/min -> 350 0C (1 min) -> 330 0C (10 min)
I 2768.
ReferenceBirkemeier and Kopka, 2007
Comment MSDC-RI

References

Birkemeier and Kopka, 2007
Birkemeier, C.; Kopka, J., Design of metabolite recovery by variations of the metabolite profiling protocol in Concepts in Plant Metabolomics, Nikolau, B.J.; Wurtele, E.S., ed(s)., Springer, Dordrecht, Netheralnds, 2007, 45-69. [all data]