(E,E)-2,4-Octadienal

Normal alkane RI, non-polar column, custom temperature program

Data compiled by: NIST Mass Spectrometry Data Center, William E. Wallace, director

Column type Capillary
Active phase VF-5 MS
Column length (m) 30.
Carrier gas Helium
Substrate
Column diameter (mm) 0.25
Phase thickness (μm) 0.25
Program not specified
I 1113.
ReferenceLiu, Lu, et al., 2011
Comment MSDC-RI

References

Liu, Lu, et al., 2011
Liu, S.; Lu, S.; Su, Y.; Guo, Y., Analysis of volatile compounds in Radix Bupleuri injection by GC-MS-MS, Chromatographia, 2011, 74, 5-6, 497-502, https://doi.org/10.1007/s10337-011-2082-7 . [all data]