7α-H-Silfiperfol-5-ene

Normal alkane RI, non-polar column, temperature ramp

View large format table.

Column type Active phase I Reference Comment
CapillaryDB-51328.Kowalski, 200530. m/0.25 mm/0.25 μm, Helium, 35. C @ 2. min, 4. K/min; Tend: 280. C

References

Kowalski, 2005
Kowalski, R., Analysis of lipophylic fraction from leaves, inflorescences and rhizomes of Siphium perfoliatum L., Acta Soc. Botanicorum Poloniae, 2005, 74, 1, 5-10, https://doi.org/10.5586/asbp.2005.001 . [all data]