α-D-Galactopyranoside, 1-O-methyl-2,3,4,6-tetrakis-(O-trimethylsilyl)

Normal alkane RI, non-polar column, custom temperature program

View large format table.

Column type Active phase I Reference Comment
CapillaryDB-5; CP-Sil 8 CB2301.Gullberg, 2005Program: not specified

References

Gullberg, 2005
Gullberg, J., Metabolomics: a tool for studying plant biology, 2005, retrieved from http://pub.epsilon.sln.se/916/1/JonasGullbergThesis2005.pdf. [all data]