Selina-4,11-diene

Normal alkane RI, polar column, custom temperature program

Data compiled by: NIST Mass Spectrometry Data Center, William E. Wallace, director

Column type Capillary
Active phase Innowax FSC
Column length (m) 60.
Carrier gas Helium
Substrate
Column diameter (mm) 0.25
Phase thickness (μm) 0.25
Program 60 0C (10 min) 4 0C/min -> 220 0C 1 0C/min -> 240 0C
I 1688.
ReferenceBardakci, Demirci, et al., 2012
Comment MSDC-RI

References

Bardakci, Demirci, et al., 2012
Bardakci, H.; Demirci, B.; Yesilada, E.; Kirmizibekmez, H.; Naser, K.H.C., Chemical composition of the essential oil of the subterranean parts of Valeriana alliariifolia, Rec. Nat. Prod., 2012, 6, 1, 89-92. [all data]