Artemisinic aldehyde

Normal alkane RI, non-polar column, temperature ramp

View large format table.

Column type Active phase I Reference Comment
CapillaryHP-51675.Bertes, Freije, et al., 200530. m/0.25 mm/0.25 μm, Helium, 55. C @ 4. min, 5. K/min, 280. C @ 10. min

Normal alkane RI, polar column, temperature ramp

View large format table.

Column type Active phase I Reference Comment
CapillaryHP-Innowax2144.Bertes, Freije, et al., 200530. m/0.25 mm/0.25 μm, Helium, 80. C @ 2. min, 5. K/min, 260. C @ 10. min

References

Bertes, Freije, et al., 2005
Bertes, C.M.; Freije, J.R.; van der Woude, H.; Verstappen, F.W.A.; Perk, L.; Marquez, V.; De Kraker, J.-W.; Posthumus, M.A.; Jansen, B.J.M.; de Groot, Ae.; Franssen, M.C.R.; Bouwmeester, H.J., Identification of intermediates and enzymes involved in the early steps of artemisinin biosynthesis in Artemisia annua, Planta Med., 2005, 71, 1, 40-47, https://doi.org/10.1055/s-2005-837749 . [all data]