(E)-Caryophyllene

Normal alkane RI, polar column, custom temperature program

Data compiled by: NIST Mass Spectrometry Data Center, William E. Wallace, director

Column type CapillaryCapillary
Active phase InnowaxDB-Wax
Column length (m) 60.60.
Carrier gas  Helium
Substrate
Column diameter (mm) 0.250.25
Phase thickness (μm) 0.330.25
Program not specified40 0C (3 min) 2 0C/min -> 150 0C 4 0C/min -> 220 0C (20 min)
I 1612.1598.
ReferenceNoorizadeh, Farmany, et al., 2011Gyawali and Kim, 2009
Comment MSDC-RI MSDC-RI

References

Noorizadeh, Farmany, et al., 2011
Noorizadeh, H.; Farmany, A.; Noorizadeh, M., Quantitative structure-retention relationships analysis of retention index of essential oils, Quim. Nova, 2011, 34, 2, 242-249, https://doi.org/10.1590/S0100-40422011000200014 . [all data]

Gyawali and Kim, 2009
Gyawali, R.; Kim, K.-S., Volatile organic compounds of medicinal values from Nepalese Acorus calamus L., Kathmandu Univ. J. Sci. Eng. Technol., 2009, 5, II, 51-65. [all data]