3-Mercaptopropyl-1-acetate

Normal alkane RI, non-polar column, custom temperature program

Data compiled by: NIST Mass Spectrometry Data Center, William E. Wallace, director

Column type Capillary
Active phase CP-Sil 5 CB
Column length (m) 25.
Carrier gas Helium
Substrate
Column diameter (mm) 0.32
Phase thickness (μm) 1.20
Program 40 0C (4 min) 2 0C/min -> 132 0C 10 0C/min -> 250 0C (45 min)
I 992.
ReferenceVermeulen, Lecocq, et al., 2003
Comment MSDC-RI

References

Vermeulen, Lecocq, et al., 2003
Vermeulen, C.; Lecocq, S.; Collin, S., Polyfunctional thiols and drinkability of beer, Polyfunctional thiols and drinkability of beer, 29th European Brewery Convention Congress, Dublin, Ireland, 17-22 May 2003, 2003, 11, retrieved from http://hdl.handle.net/2078.1/72705. [all data]