3-Mercaptopropyl acetate

Normal alkane RI, non-polar column, custom temperature program

View large format table.

Column type Active phase I Reference Comment
CapillaryCP-Sil 5 CB992.Liu, Cao, et al., 2009Column length: 50. m; Column diameter: 0.32 mm; Program: not specified
CapillaryCP-Sil 5 CB989.Bailly, Jerkovic, et al., 200650. m/0.32 mm/1.20 μm, Helium; Program: 36 0C 20 0C/min -> 85 0C 1 0C/min -> 1345 0C 3 0C/min -> 250 0C

Normal alkane RI, polar column, custom temperature program

View large format table.

Column type Active phase I Reference Comment
CapillaryFFAP-CB1565.Bailly, Jerkovic, et al., 200625. m/0.32 mm/0.30 μm, Helium; Program: 36 0C 20 0C/min -> 85 0C 1 0C/min -> 1345 0C 3 0C/min -> 250 0C

References

Liu, Cao, et al., 2009
Liu, F.; Cao, C.; Li, X., Quantitative structure-retention relationship study of mercapto-compounds by the method of dividing the molecular structure into substructure, QSAR Comb. Sci., 2009, 28, 11-12, 1358-1366, https://doi.org/10.1002/qsar.200960043 . [all data]

Bailly, Jerkovic, et al., 2006
Bailly, S.; Jerkovic, V.; Collin, S., Identification of key-odorants in Sauternes wines, Identification of key-odorants in Sauternes wines, 5th International Terroir Congress, 2006, 4. [all data]