Humulene epoxide I

Normal alkane RI, non-polar column, temperature ramp

Data compiled by: NIST Mass Spectrometry Data Center, William E. Wallace, director

Column type CapillaryCapillaryCapillary
Active phase DB-5 MSHP-5 MSDB-5
Column length (m) 60.30.30.
Carrier gas HeliumHeliumHelium
Substrate
Column diameter (mm) 0.250.250.25
Phase thickness (μm) 0.250.250.25
Tstart (C) 40.70.100.
Tend (C) 250.290.300.
Heat rate (K/min) 5.5.20.
Initial hold (min) 15. 2.
Final hold (min) 15.10.10.
I 1625.1607.1575.
ReferenceMesa-Arango, Betancur-Galvis, et al., 2010Radulovic, Blagojevic, et al., 2010Khokra, Prakash, et al., 2008
Comment MSDC-RI MSDC-RI MSDC-RI

References

Mesa-Arango, Betancur-Galvis, et al., 2010
Mesa-Arango, A.C.; Betancur-Galvis, L.; Montiel, J.; Bueno, J.G.; Baena, A.; Duran, D.C.; Martinez, J.R.; Stashenko, E.E., Antifungal activity and chemical composition of the essential oils of Lippia alba (Miller) N.E. Brown grown in different regions of Colombia, J. Essential Oil Res., 2010, 22, 6, 568-574, https://doi.org/10.1080/10412905.2010.9700402 . [all data]

Radulovic, Blagojevic, et al., 2010
Radulovic, N.; Blagojevic, P.; Palic, R., Comparative study of the leaf volatiles of Arctostaphylos uva-ursi (L.) Spreng. and Vaccinium vitis-idaea L. (Ericaceae), Molecules, 2010, 15, 9, 6168-6185, https://doi.org/10.3390/molecules15096168 . [all data]

Khokra, Prakash, et al., 2008
Khokra, S.L.; Prakash, O.; Jain, S.; Aneja, K.R.; Dhingra, Y., Essential oil composition and antibacterial studies of Vitex negundo Linn. extracts, Indian J. Pharm. Sci., 2008, 70, 4, 522-526, https://doi.org/10.4103/0250-474X.44610 . [all data]