Humulene epoxide II

Normal alkane RI, non-polar column, custom temperature program

Data compiled by: NIST Mass Spectrometry Data Center, William E. Wallace, director

Column type CapillaryCapillaryCapillaryCapillaryCapillary
Active phase 5 % Phenyl polydimethyl siloxaneHP-5 MSHP-5HP-5HP-5
Column length (m)  30.25.25.25.
Carrier gas  HeliumHeliumHeliumHelium
Substrate
Column diameter (mm)  0.250.320.320.32
Phase thickness (μm)  0.250.170.170.17
Program not specified40 0C (10 min) 3 0C/min -> 200 0C 2 0C/min -> 220 0C60 0C (5 min) 4 0C/min -> 220 0C 11 0C/min -> 280 0C (15 min)60 0C (5 min) 4 0C/min -> 220 0C 11 0C/min -> 280 0C (15 min)not specified
I 1607.1609.1601.1609.1608.
ReferenceChaverri, Diaz, et al., 2011Nance and Setzer, 2011Custer, 2009Custer, 2009Custer, 2009
Comment MSDC-RI MSDC-RI MSDC-RI MSDC-RI MSDC-RI
Column type CapillaryCapillaryCapillary
Active phase HP-5HP-5 MSDB-5
Column length (m) 25.30.50.
Carrier gas HeliumHeliumHelium
Substrate
Column diameter (mm) 0.320.250.32
Phase thickness (μm) 0.170.250.25
Program not specified40 0C (5 min) 2 0C/min -> 270 0C -> 260 0C (20 min)60 0C (1 min) 5 0C/min -> 160 0C 10 0C/min -> 250 0C
I 1608.1605.1608.
ReferenceCuster, 2009Mancini, Arnold, et al., 2009Nivinsliene, Butkiene, et al., 2007
Comment MSDC-RI MSDC-RI MSDC-RI

Normal alkane RI, polar column, custom temperature program

Data compiled by: NIST Mass Spectrometry Data Center, William E. Wallace, director

Column type CapillaryCapillaryCapillaryCapillary
Active phase Innowax FSCHP-InnowaxInnowax FSCHP Innowax
Column length (m) 60.60.60.50.
Carrier gas HeliumHeliumHeliumHelium
Substrate
Column diameter (mm) 0.250.250.250.20
Phase thickness (μm) 0.250.250.250.25
Program 60 0C (10 min) 4 0C/min -> 220 0C 1 0C/min -> 240 0Cnot specified60 0C (10 min) 4 0C/min -> 220 0C (10 min) 1 0C/min -> 240 0C40 0C (5 min) 2 0C/min -> 270 0C -> 260 0C (20 min)
I 2071.2002.2071.2011.
ReferenceBardakci, Demirci, et al., 2012Feng, Cui, et al., 2011Polatoglu, Demirci, et al., 2010Mancini, Arnold, et al., 2009
Comment MSDC-RI MSDC-RI MSDC-RI MSDC-RI

References

Chaverri, Diaz, et al., 2011
Chaverri, C.; Diaz, C.; Cicco, J.F., Chemical analysis of essential oils from Ocotea gomezii W.C. Burger and Ocotea morae Gomez-Laur. (Lauraceae) collected at Reserva biologica Alberto M. Brenes in Costa Rica and their cytotoxic activity on Tumor cell lines, J. Braz. Chem. Soc., 2011, 22, 4, s1-s4, https://doi.org/10.1590/S0103-50532011000400018 . [all data]

Nance and Setzer, 2011
Nance, M.R.; Setzer, W.N., Volatile components of aroma hops (Humulus lupulus L.) commonly used in beer brewing, J. of Brewing and Distilling, 2011, 2, 2, 16-22. [all data]

Custer, 2009
Custer, Y., GC Volatile Components Analysis of Different Parts of Litchi chinensis (Dissertation), 2009. [all data]

Mancini, Arnold, et al., 2009
Mancini, E.; Arnold, N.A.; De Martino, L.; De Feo, V.; Formisano, C.; Rigano, D.; Senatore, F., Chemical composition and phytotoxic effects of essential oils of Salvia hierosolymitana Boiss. and Salvia multicaulis Vahl. var. simplicifolia Boiss. growing wild in Lebanon, Molecules, 2009, 14, 11, 4725-4736, https://doi.org/10.3390/molecules14114725 . [all data]

Nivinsliene, Butkiene, et al., 2007
Nivinsliene, O.; Butkiene, R.; Gudalevic, A.; Mockute, D.; Meskauskiene, V.; Grigaliunaite, B., Influence of urban environment on chemical composition of Tilia cordata essential oil, Chemija, 2007, 18, 1, 44-49. [all data]