3,3-Dimethylbutanal

Normal alkane RI, non-polar column, isothermal

View large format table.

Column type Active phase Temperature (C) I Reference Comment
CapillaryOV-160.689.Amboni, Junkes, et al., 2002

References

Amboni, Junkes, et al., 2002
Amboni, R.D.DeM.C.; Junkes, B. daS.; Yunes, R.A.; Heinzen, V.E.F., Quantitative structure-property relationships study of chromatographic retention indices and normal boiling points for oxo compounds using the semi-empirical topological method, J. Mol. Struct. (Theochem), 2002, 586, 1-3, 71-80, https://doi.org/10.1016/S0166-1280(02)00062-3 . [all data]