(Z)-2-Penten-1-ol

Normal alkane RI, non-polar column, temperature ramp

Data compiled by: NIST Mass Spectrometry Data Center, William E. Wallace, director

Column type CapillaryCapillaryCapillary
Active phase HP-5 MSHP-5 MSOV-101
Column length (m) 30.30.50.
Carrier gas HeliumHeliumNitrogen
Substrate
Column diameter (mm) 0.250.250.25
Phase thickness (μm) 0.250.25
Tstart (C) 70.70.40.
Tend (C) 290.290.200.
Heat rate (K/min) 5.5.2.
Initial hold (min)   10.
Final hold (min)  10.
I 765.765.746.
ReferenceLazarevic, Radulovic, et al., 2010Radulovic, Blagojevic, et al., 2010Tamura, Boonbumrung, et al., 2000
Comment MSDC-RI MSDC-RI MSDC-RI

Normal alkane RI, polar column, custom temperature program

Data compiled by: NIST Mass Spectrometry Data Center, William E. Wallace, director

Column type CapillaryCapillaryCapillaryCapillaryCapillary
Active phase DB-WaxDB-WaxDB-WaxSupelko CO WaxSupelko CO Wax
Column length (m) 30.30.30.60.60.
Carrier gas HeliumHeliumHeliumHeliumHelium
Substrate
Column diameter (mm) 0.250.250.250.320.32
Phase thickness (μm) 0.250.250.250.250.25
Program not specifiednot specifiednot specified40 0C (5 min) 4 0C/min -> 75 0C 5 0C/min -> 250 0C (10 min)not specified
I 1317.1326.1335.1321.1320.
ReferenceWelke, Manfroi, et al., 2012Welke, Manfroi, et al., 2012Welke, Manfroi, et al., 2012Vekiari, Orepoulou, et al., 2010Vekiari, Orepoulou, et al., 2010
Comment MSDC-RI MSDC-RI MSDC-RI MSDC-RI MSDC-RI

References

Lazarevic, Radulovic, et al., 2010
Lazarevic, J.; Radulovic, N.; Palic, R.; Zlatkovic, B., Chemical Analusis of volatile constituents of Berula erecta (Hudson) Coville subsp. erecta (Apiaceae) from Serbia, J. Essential Oil. Res., 2010, 22, 3, 153-156, https://doi.org/10.1080/10412905.2010.9700290 . [all data]

Radulovic, Blagojevic, et al., 2010
Radulovic, N.; Blagojevic, P.; Palic, R., Comparative study of the leaf volatiles of Arctostaphylos uva-ursi (L.) Spreng. and Vaccinium vitis-idaea L. (Ericaceae), Molecules, 2010, 15, 9, 6168-6185, https://doi.org/10.3390/molecules15096168 . [all data]

Tamura, Boonbumrung, et al., 2000
Tamura, H.; Boonbumrung, S.; Yoshizawa, T.; Varanyanond, W., Volatile components of the essential oil in the pulp of four yellow mangoes (Mangifera indica L.) in Thailand, Food Sci. Technol. Res., 2000, 6, 1, 68-73, https://doi.org/10.3136/fstr.6.68 . [all data]