trans-Linalool oxide (furanoid)

Normal alkane RI, non-polar column, temperature ramp

Data compiled by: NIST Mass Spectrometry Data Center, William E. Wallace, director

Column type CapillaryCapillaryCapillaryCapillaryCapillary
Active phase VF-5 MSVF-5 MSHP-5 MSHP-5 MSBP-1
Column length (m) 60.60.30.30.
Carrier gas HeliumHeliumHeliumHeliumNitrogen
Substrate
Column diameter (mm) 0.320.320.250.25
Phase thickness (μm) 0.250.250.250.25
Tstart (C) 30.30.70.70.60.
Tend (C) 260.260.200.200.220.
Heat rate (K/min) 2.2.3.3.5.
Initial hold (min)   2.2.10.
Final hold (min) 28.28.18.18.30.
I 1087.1089.1076.1076.1076.
ReferenceLeffingwell and Alford, 2011Leffingwell and Alford, 2011Jerkovic, Hegic, et al., 2010Jerkovic and Marijanovic, 2010Mishra, Chaudhary, et al., 2010
Comment MSDC-RI MSDC-RI MSDC-RI MSDC-RI MSDC-RI
Column type CapillaryCapillaryCapillaryCapillaryCapillary
Active phase HP-5HP-5 MSHP-5 MSDB-5OV-101
Column length (m) 30.30.30.30.50.
Carrier gas HeliumHeliumHeliumHeliumNitrogen
Substrate
Column diameter (mm) 0.250.250.250.250.25
Phase thickness (μm) 0.250.250.250.25
Tstart (C) 50.70.70.50.40.
Tend (C) 240.290.290.250.200.
Heat rate (K/min) 3.5.5.5.2.
Initial hold (min) 5.  2.10.
Final hold (min)  10.10.
I 1073.1092.1089.1073.1080.
ReferenceMonsef-Esfahani, Miri, et al., 2010Radulovic, Blagojevic, et al., 2010Radulovic, Dordevic, et al., 2010Ho, Wang, et al., 2009Tamura, Boonbumrung, et al., 2000
Comment MSDC-RI MSDC-RI MSDC-RI MSDC-RI MSDC-RI

References

Leffingwell and Alford, 2011
Leffingwell, J.; Alford, E.D., Volatile constituents of the giant pufball mushroom (Calvatia gigantea), Leffingwell Rep., 2011, 4, 1-17. [all data]

Jerkovic, Hegic, et al., 2010
Jerkovic, I.; Hegic, G.; Marijanovic, Z.; Bubalo, D., Organic extractives from Mentha spp. honey and the bee-stomach: methyl syringate, vomifoliol, terpenediol I, hotrienol, and other compounds, Molecules, 2010, 15, 4, 2911-2924, https://doi.org/10.3390/molecules15042911 . [all data]

Jerkovic and Marijanovic, 2010
Jerkovic, I.; Marijanovic, Z., Oak (Quercus frainetto Ten.) honeydaw honey - approach to screening of volatile organic composition and antioxidant capacity (DPPH and FRAP assay), Molecules, 2010, 15, 5, 3744-3756, https://doi.org/10.3390/molecules15053744 . [all data]

Mishra, Chaudhary, et al., 2010
Mishra, R.K.; Chaudhary, S.; Pandey, R.; Gupta, S.; Mallavarapu, G.R.; Kumar, S., Analysis of linalool content in the inflorescence (flower) essential oil and leaf oil of Lippia alba cultivar Kavach, J. Essen. Oil Res., 2010, 22, 1, 3-7, https://doi.org/10.1080/10412905.2010.9700253 . [all data]

Monsef-Esfahani, Miri, et al., 2010
Monsef-Esfahani, H.R.; Miri, A.; Amini, M.; Amanzadeh, Y.; Hadjiakhoondi, A.; Hajiaghaee, R.; Ajani, Y., Seasonal variations in the chemical composition, antioxidant activity and total phenolic content of Teucrium persicum Boiss. essential oils, Res. J. Biol. Sci., 2010, 5, 7, 492-498, https://doi.org/10.3923/rjbsci.2010.492.498 . [all data]

Radulovic, Blagojevic, et al., 2010
Radulovic, N.; Blagojevic, P.; Palic, R., Comparative study of the leaf volatiles of Arctostaphylos uva-ursi (L.) Spreng. and Vaccinium vitis-idaea L. (Ericaceae), Molecules, 2010, 15, 9, 6168-6185, https://doi.org/10.3390/molecules15096168 . [all data]

Radulovic, Dordevic, et al., 2010
Radulovic, N.; Dordevic, N.; Markovic, M.; Palic, R., Volatile constituents of Glechoma Hirsuta Waldst. Kit. and G. Hederacea L. (Lamiaceae), Bull. Chem. Soc. Ethiop., 2010, 24, 1, 67-76, https://doi.org/10.4314/bcse.v24i1.52962 . [all data]

Ho, Wang, et al., 2009
Ho, C.-L.; Wang, E.I.-C.; Su, Y.-C., Essential oil compositions and bioactivities of the various parts of Cinnamomum camphora Sieb. var. linallolifera Fujuta, Journal title only in Chinese, 2009, 31, 2, 77-96. [all data]

Tamura, Boonbumrung, et al., 2000
Tamura, H.; Boonbumrung, S.; Yoshizawa, T.; Varanyanond, W., Volatile components of the essential oil in the pulp of four yellow mangoes (Mangifera indica L.) in Thailand, Food Sci. Technol. Res., 2000, 6, 1, 68-73, https://doi.org/10.3136/fstr.6.68 . [all data]