2-Propionyl-2-thiazoline

Normal alkane RI, non-polar column, custom temperature program

Data compiled by: NIST Mass Spectrometry Data Center, William E. Wallace, director

Column type Capillary
Active phase DB-5
Column length (m) 30.
Carrier gas Helium
Substrate
Column diameter (mm) 0.25
Phase thickness (μm) 0.25
Program 35 0C (2 min) 40 0C/min -> 50 0C (1 min) 6 0C/min -> 180 0C 10 0C/min -> 240 0C (10 min)
I 1212.
ReferenceLin, Fay, et al., 2000
Comment MSDC-RI

References

Lin, Fay, et al., 2000
Lin, J.; Fay, L.B.; Blank, I., Aroma impact compounds formed in meat-like model systems containing cysteine, ribose, and phospholipids in Frontiers of Flavour Science, Scheberle, P.; Engel, K.-H., ed(s)., Deutsche Forschungsanstalt fur Lebensmittelchemie, Garching, 2000, 498-502. [all data]