Homofuraneol

Normal alkane RI, polar column, custom temperature program

Data compiled by: NIST Mass Spectrometry Data Center, William E. Wallace, director

Column type CapillaryCapillary
Active phase FFAP-CBFFAP
Column length (m) 25.25.
Carrier gas NitrogenNitrogen
Substrate
Column diameter (mm) 0.320.32
Phase thickness (μm) 0.300.30
Program 36 0C 20 0C/min -> 85 0C 1 0C/min -> 145 0C 3 0C/min -> 220 0C36 0C 20 0C/min -> 85 0C 1 0C -> 145 0C 3 0C/min -> 230 0C
I 2083.2083.
ReferenceCollin, Nizet, et al., 2012Bailly, Jerkovic, et al., 2009
Comment MSDC-RI MSDC-RI

References

Collin, Nizet, et al., 2012
Collin, S.; Nizet, S.; Bouuaert, T.C.; Despartures, P.-M., MAin odorants in Jura Flor-Sherry wines. Relative contributions of sotolon, abhexon, and theaspirane-derived compounds, J. Agr. Food Chem., 2012, 60, 1, 380-381, https://doi.org/10.1021/jf203832c . [all data]

Bailly, Jerkovic, et al., 2009
Bailly, S.; Jerkovic, V.; Meuree, A.; Timmermans, A.; Collin, S., Fate of key odorants in Sauternes wines through aging, J. Agric. Food Chem., 2009, 57, 18, 8557-8563, https://doi.org/10.1021/jf901429d . [all data]