(Z)-1,5-Octadien-3-one

Normal alkane RI, non-polar column, temperature ramp

View large format table.

Column type Active phase I Reference Comment
CapillaryDB-5 MS977.Suriyaphan, Drake, et al., 199960. m/0.32 mm/0.25 μm, Helium, 40. C @ 5. min, 3. K/min, 200. C @ 30. min

Normal alkane RI, non-polar column, custom temperature program

View large format table.

Column type Active phase I Reference Comment
CapillarySE-54979.Blank, Lin, et al., 200630. m/0.32 mm/0.25 μm, Helium; Program: not specified

Normal alkane RI, polar column, temperature ramp

View large format table.

Column type Active phase I Reference Comment
CapillaryDB-Wax1370.Kumazawa, Sakai, et al., 201030. m/0.25 mm/0.25 μm, Helium, 3. K/min; Tstart: 40. C; Tend: 210. C
CapillaryDB-Wax1386.Spadone, Matthey-Doret, et al., 200660. m/0.25 mm/0.25 μm, Helium, 35. C @ 3. min, 6. K/min, 240. C @ 10. min

References

Suriyaphan, Drake, et al., 1999
Suriyaphan, O.; Drake, M.A.; Cadwallader, K.R., Identification of volatile off-flavors in reduced-fat cheddar cheeses containing lecitin, Lebensm.-Wiss. u. Technol., 1999, 32, 5, 250-254, https://doi.org/10.1006/fstl.1999.0543 . [all data]

Blank, Lin, et al., 2006
Blank, I.; Lin, J.; Leser, M.E.; Loeliger, J., Formation of odor-active carbonyls in self-assembly structures of phosholipids in Foor Lipids: Chemistry, Flavor, and Texture, Shahidi, F.; Weenen, H., ed(s)., American Chemical Society, Washington, DC, 2006, 19-34. [all data]

Kumazawa, Sakai, et al., 2010
Kumazawa, K.; Sakai, N.; Amma, H.; Sakamoto, S.; Kodama, M.; Wada, Y.; Nishimura, O., Identification and formation of volatile components responsible for the characteristic aroma of Mat Rush (Igusa), Biosci. Biotechnol. Biochem., 2010, 74, 6, 1231-1236, https://doi.org/10.1271/bbb.100053 . [all data]

Spadone, Matthey-Doret, et al., 2006
Spadone, J.-C.; Matthey-Doret, W.; Blank, I., Formation of methyl(methylthio)methyl disulfide in broccoli (Brassica oleracea (L.) var. italica) in Flavour Science: Recent Advances and Trends, Bredie, W.L.P.; Petersen, M.A., ed(s)., Elsevier, Amsterdam, 2006, 309-314. [all data]