trans-Sabinyl acetate

Normal alkane RI, non-polar column, custom temperature program

Data compiled by: NIST Mass Spectrometry Data Center, William E. Wallace, director

Column type CapillaryCapillaryCapillary
Active phase RTX-1RTX-1
Column length (m) 60.60.
Carrier gas HeliumHelium
Substrate
Column diameter (mm) 0.220.22
Phase thickness (μm) 0.250.25
Program not specifiednot specifiednot specified
I 1271.1271.1275.
ReferenceBendiabdellah, El Amine Dib, et al., 2012Bendiabdellah, El Amine Dib, et al., 2012El-Shazily, Hafez, et al., 2004
Comment MSDC-RI MSDC-RI MSDC-RI

References

Bendiabdellah, El Amine Dib, et al., 2012
Bendiabdellah, A.; El Amine Dib, M.; Djabou, N.; Allali, H.; Tabti, B.; Costa, J.; Myseli, A., Biological activities and volatile cinstituents of Daucus muricatus L. from Algeria, Chem. Centr. J., 2012, 6, 48, 1-22. [all data]

El-Shazily, Hafez, et al., 2004
El-Shazily, A.M.; Hafez, S.S.; Wink, M., Comparative study of the essential oils and extracts of Achillea fragrantissima (Forssk.) Sch. Bip. and Achillea santolina L. (Asteraceae) from Egypt, Pharmazie, 2004, 59, 226-230. [all data]