trans-β-Farnesene

Normal alkane RI, non-polar column, temperature ramp

View large format table.

Column type Active phase I Reference Comment
CapillarySE-30 MS1441.Menichini, Tundis, et al., 201130. m/0.25 mm/0.25 μm, Helium, 50. C @ 5. min, 5. K/min, 250. C @ 10. min
CapillaryDB-51457.Ho, Wang, et al., 201030. m/0.25 mm/0.25 μm, Helium, 2. K/min; Tstart: 50. C; Tend: 250. C
CapillaryOV-11441.Bicchi, Binello, et al., 199925. m/0.32 mm/0.30 μm, Hydrogen, 50. C @ 1. min, 3. K/min, 200. C @ 10. min
CapillaryOV-11442.Bicchi, Binello, et al., 199925. m/0.32 mm/0.30 μm, Hydrogen, 50. C @ 1. min, 3. K/min, 200. C @ 10. min
CapillaryOV-11442.Bicchi, Binello, et al., 199925. m/0.32 mm/0.30 μm, Hydrogen, 50. C @ 1. min, 3. K/min, 200. C @ 10. min
CapillaryOV-11442.Bicchi, Binello, et al., 199925. m/0.32 mm/0.30 μm, Hydrogen, 50. C @ 1. min, 3. K/min, 200. C @ 10. min
CapillaryOV-11443.Bicchi, Binello, et al., 199925. m/0.32 mm/0.30 μm, Hydrogen, 50. C @ 1. min, 3. K/min, 200. C @ 10. min
CapillaryOV-11443.Bicchi, Binello, et al., 199925. m/0.32 mm/0.30 μm, Hydrogen, 50. C @ 1. min, 3. K/min, 200. C @ 10. min
CapillaryOV-11444.Bicchi, Binello, et al., 199925. m/0.32 mm/0.30 μm, Hydrogen, 50. C @ 1. min, 3. K/min, 200. C @ 10. min

Normal alkane RI, non-polar column, custom temperature program

View large format table.

Column type Active phase I Reference Comment
CapillaryHP-51461.Custer, 200925. m/0.32 mm/0.17 μm, Helium; Program: 60 0C (5 min) 4 0C/min -> 220 0C 11 0C/min -> 280 0C (15 min)
CapillaryHP-51456.Custer, 200925. m/0.32 mm/0.17 μm, Helium; Program: not specified
Capillary5 % Phenyl methylsiloxane1472.Serrano, Cornu, et al., 2007Program: not specified

Normal alkane RI, polar column, temperature ramp

View large format table.

Column type Active phase I Reference Comment
CapillaryHP-Innowax1667.Feng, Cui, et al., 201160. m/0.25 mm/0.25 μm, Helium, 60. C @ 1. min, 5. K/min, 220. C @ 5. min
CapillaryHP-Innowax1662.Menichini, Tundis, et al., 201130. m/0.25 mm/0.25 μm, Helium, 50. C @ 5. min, 5. K/min, 250. C @ 10. min
CapillaryCW 20M1646.Bicchi, Binello, et al., 199925. m/0.32 mm/0.25 μm, Hydrogen, 50. C @ 1. min, 3. K/min, 220. C @ 10. min
CapillaryCW 20M1658.Bicchi, Binello, et al., 199925. m/0.32 mm/0.25 μm, Hydrogen, 50. C @ 1. min, 3. K/min, 220. C @ 10. min

Normal alkane RI, polar column, custom temperature program

View large format table.

Column type Active phase I Reference Comment
CapillaryHP-Innowax1662.Feng, Cui, et al., 201160. m/0.25 mm/0.25 μm, Helium; Program: not specified

References

Menichini, Tundis, et al., 2011
Menichini, F.; Tundis, R.; Bonesi, M.; de Cindio, B.; Loizzo, M.R.; Conforti, F.; Statti, G.A.; Menabeni, R.; Bettini, R.; Menichini, F., Chemical composition and bioactivity of Citrus medica L. cv. Diamante essential oil obtained by hydrodistillation, cold-pressing and supercritical carbon dioxide extraction, Nat. Prod. Res., 2011, 25, 8, 789-799, https://doi.org/10.1080/14786410902900085 . [all data]

Ho, Wang, et al., 2010
Ho, C.-L.; Wang, E.I.-C.; Yu, H.-T.; Yu, H.-M.; Su, Y.-C., Composition amd antioxidant activities of essential oils of different tissues from Cryptomeria japonica D. Don, Quarterly J. Chin. Forestry, 2010, 32, 1, 63-76. [all data]

Bicchi, Binello, et al., 1999
Bicchi, C.; Binello, A.; D'Amato, A.; Rubiolo, P., Reliability of Van den Dool retention indices in the analysis of essential oils, J. Chromatogr. Sci., 1999, 37, 8, 288-294, https://doi.org/10.1093/chromsci/37.8.288 . [all data]

Custer, 2009
Custer, Y., GC Volatile Components Analysis of Different Parts of Litchi chinensis (Dissertation), 2009. [all data]

Serrano, Cornu, et al., 2007
Serrano, E.; Cornu, A.; Kondjoyan, N.; Figueredo, G.; Agabriel, J.; Micol, D., Terpene accumulation in muscle and fatty tissues of calves supplement with essential oils, J. Animal Feed Sci., 2007, 16, 168-179. [all data]

Feng, Cui, et al., 2011
Feng, T.; Cui, J.-J.; Xiao, Z.-B.; Tian, H.-X.; Yi, F.-P.; Ma, X., Chemical composition od essential oil from the peel of Chinese Torreya grandis Frt, Org. Chem. International, 2011, 2011, 1-5, https://doi.org/10.1155/2011/187372 . [all data]