Methyl epi-jasmonate

Normal alkane RI, non-polar column, temperature ramp

View large format table.

Column type Active phase I Reference Comment
CapillaryDB-51675.Tellez, Estell, et al., 199730. m/0.25 mm/0.25 μm, Helium, 3. K/min; Tstart: 60. C; Tend: 240. C

References

Tellez, Estell, et al., 1997
Tellez, M.R.; Estell, R.E.; Frederickson, E.L.; Havstad, K.M., Essntial oil of Flourensia cernua DC, J. Essent. Oil Res., 1997, 9, 6, 619-624, https://doi.org/10.1080/10412905.1997.9700799 . [all data]