epi-Cubebol

Normal alkane RI, non-polar column, temperature ramp

Data compiled by: NIST Mass Spectrometry Data Center, William E. Wallace, director

Column type CapillaryCapillaryCapillary
Active phase DB-5DB-5DB-5
Column length (m) 30.60.30.
Carrier gas HeliumNitrogenHelium
Substrate
Column diameter (mm) 0.250.250.25
Phase thickness (μm) 0.250.250.25
Tstart (C) 50.60.60.
Tend (C) 250.250.240.
Heat rate (K/min) 2.5.3.
Initial hold (min)
Final hold (min)  10.
I 1494.1490.1494.
ReferenceHo, Wang, et al., 2010Mosayebi, Amin, et al., 2008Tellez, Estell, et al., 1997
Comment MSDC-RI MSDC-RI MSDC-RI

Normal alkane RI, non-polar column, custom temperature program

Data compiled by: NIST Mass Spectrometry Data Center, William E. Wallace, director

Column type Capillary
Active phase DB-5
Column length (m) 50.
Carrier gas Helium
Substrate
Column diameter (mm) 0.32
Phase thickness (μm) 0.25
Program 60 0C (1 min) 5 0C/min -> 160 0C 10 0C/min -> 250 0C
I 1494.
ReferenceNivinsliene, Butkiene, et al., 2007
Comment MSDC-RI

References

Ho, Wang, et al., 2010
Ho, C.-L.; Wang, E.I.-C.; Yu, H.-T.; Yu, H.-M.; Su, Y.-C., Composition amd antioxidant activities of essential oils of different tissues from Cryptomeria japonica D. Don, Quarterly J. Chin. Forestry, 2010, 32, 1, 63-76. [all data]

Mosayebi, Amin, et al., 2008
Mosayebi, M.; Amin, G.; Arzani, H.; Azarnivand, H.; Maleki, M.; Shafaghat, A., Effect of habitat on essential oil of Achillea filipendula L. in Iran, Asian J. Plant Sci., 2008, 7, 8, 779-781, https://doi.org/10.3923/ajps.2008.779.781 . [all data]

Tellez, Estell, et al., 1997
Tellez, M.R.; Estell, R.E.; Frederickson, E.L.; Havstad, K.M., Essntial oil of Flourensia cernua DC, J. Essent. Oil Res., 1997, 9, 6, 619-624, https://doi.org/10.1080/10412905.1997.9700799 . [all data]