1-epi-Cubenol

Normal alkane RI, non-polar column, custom temperature program

Data compiled by: NIST Mass Spectrometry Data Center, William E. Wallace, director

Column type CapillaryCapillaryCapillaryCapillaryCapillary
Active phase 5 % Phenyl polydimethyl siloxaneHP-5 MSHP-5HP-5HP-5
Column length (m)  30.25.25.25.
Carrier gas  HeliumHeliumHeliumHelium
Substrate
Column diameter (mm)  0.250.320.320.32
Phase thickness (μm)  0.250.170.170.17
Program not specified40 0C (10 min) 3 0C/min -> 200 0C 2 0C/min -> 220 0C60 0C (5 min) 4 0C/min -> 220 0C 11 0C/min -> 280 0C (15 min)60 0C (5 min) 4 0C/min -> 220 0C 11 0C/min -> 280 0C (15 min)not specified
I 1628.1626.1623.1630.1627.
ReferenceChaverri, Diaz, et al., 2011Nance and Setzer, 2011Custer, 2009Custer, 2009Custer, 2009
Comment MSDC-RI MSDC-RI MSDC-RI MSDC-RI MSDC-RI
Column type CapillaryCapillary
Active phase HP-5DB-5
Column length (m) 25.50.
Carrier gas HeliumHelium
Substrate
Column diameter (mm) 0.320.32
Phase thickness (μm) 0.170.25
Program not specified60 0C (1 min) 5 0C/min -> 160 0C 10 0C/min -> 250 0C
I 1628.1629.
ReferenceCuster, 2009Nivinsliene, Butkiene, et al., 2007
Comment MSDC-RI MSDC-RI

Normal alkane RI, non-polar column, temperature ramp

Data compiled by: NIST Mass Spectrometry Data Center, William E. Wallace, director

Column type CapillaryCapillaryCapillaryCapillaryCapillary
Active phase HP-5 MSCP-Sil 5 CBDB-5SPB-1DB-5
Column length (m) 30.30.30.30.30.
Carrier gas HeliumNitrogenHeliumHeliumHelium
Substrate
Column diameter (mm) 0.250.250.250.250.25
Phase thickness (μm) 0.250.260.250.250.25
Tstart (C) 60.45.50.50.60.
Tend (C) 220.280.250.250.240.
Heat rate (K/min) 4.3.2.5.3.
Initial hold (min) 20.  3.
Final hold (min) 20.22. 15.
I 1619.1623.1629.1625.1625.
ReferenceFeizbakhsh and Naeemy, 2011Mothana, Hasson, et al., 2011Ho, Wang, et al., 2010Lazarevic, Palic, et al., 2010Magalhaes, Lima, et al., 2010
Comment MSDC-RI MSDC-RI MSDC-RI MSDC-RI MSDC-RI
Column type CapillaryCapillaryCapillary
Active phase DB-5CP-Sil 5 CBDB-5
Column length (m) 30.25.30.
Carrier gas HeliumHydrogenHelium
Substrate
Column diameter (mm) 0.250.250.25
Phase thickness (μm) 0.250.150.25
Tstart (C) 50.50.60.
Tend (C) 250.230.240.
Heat rate (K/min) 5.3.3.
Initial hold (min) 2.
Final hold (min)
I 1629.1616.1628.
ReferenceHo, Wang, et al., 2009Olawore, Usman, et al., 2006Tellez, Estell, et al., 1997
Comment MSDC-RI MSDC-RI MSDC-RI

References

Chaverri, Diaz, et al., 2011
Chaverri, C.; Diaz, C.; Cicco, J.F., Chemical analysis of essential oils from Ocotea gomezii W.C. Burger and Ocotea morae Gomez-Laur. (Lauraceae) collected at Reserva biologica Alberto M. Brenes in Costa Rica and their cytotoxic activity on Tumor cell lines, J. Braz. Chem. Soc., 2011, 22, 4, s1-s4, https://doi.org/10.1590/S0103-50532011000400018 . [all data]

Nance and Setzer, 2011
Nance, M.R.; Setzer, W.N., Volatile components of aroma hops (Humulus lupulus L.) commonly used in beer brewing, J. of Brewing and Distilling, 2011, 2, 2, 16-22. [all data]

Custer, 2009
Custer, Y., GC Volatile Components Analysis of Different Parts of Litchi chinensis (Dissertation), 2009. [all data]

Nivinsliene, Butkiene, et al., 2007
Nivinsliene, O.; Butkiene, R.; Gudalevic, A.; Mockute, D.; Meskauskiene, V.; Grigaliunaite, B., Influence of urban environment on chemical composition of Tilia cordata essential oil, Chemija, 2007, 18, 1, 44-49. [all data]