10-epi-γ-Eudesmol

Normal alkane RI, non-polar column, custom temperature program

Data compiled by: NIST Mass Spectrometry Data Center, William E. Wallace, director

Column type CapillaryCapillaryCapillaryCapillaryCapillary
Active phase DB-1CBP-5DB-5 MSHP-5HP-1
Column length (m) 30.30.30.30.25.
Carrier gas HydrogenHeliumHeliumHelium
Substrate
Column diameter (mm) 0.250.250.250.250.32
Phase thickness (μm) 0.250.25 0.250.17
Program 45 0C 3 0C/min -> 175 0C 15 0C/min -> 300 0C (10 min)60 0C 3 0C/min -> 246 0C 10 0C/min -> 270 0C (5 min)50 0C (1.5 min) 4 0C/min -> 200 0C 10 0C/min -> 300 0C (10 min)not specifiednot specified
I 1593.1622.1632.1624.1599.
ReferenceAlbano, Lima, et al., 2012Fortes, Naves, et al., 2011Lima, Quintans-Junior, et al., 2011Bi Kouame, Bedi, et al., 2010Wetwiayaklung, Thavanapong, et al., 2009
Comment MSDC-RI MSDC-RI MSDC-RI MSDC-RI MSDC-RI
Column type Capillary
Active phase
Column length (m)
Carrier gas
Substrate
Column diameter (mm)
Phase thickness (μm)
Program not specified
I 1619.
ReferenceEl-Shazily, Hafez, et al., 2004
Comment MSDC-RI

References

Albano, Lima, et al., 2012
Albano, S.M.; Lima, A.S.; Miguel, M.G.; Pedro, L.G.; Barroso, J.G.; Figueiredo, A.C., Antioxidant, anti-5-lipoxygenase and antiacetylcholinesterase activities of essential oils and decoction water of some aromatic plants, Rec. Nat. Prod., 2012, 6, 1, 35-48. [all data]

Fortes, Naves, et al., 2011
Fortes, G.A.C.; Naves, S.S.; Godoi, F.F.F.; Duarte, A.R.; Ferri, P.H.; Santos, S.C., Assessment of a maturity index in Jabuticaba fruit by the evaluation of phenolic compounds, essential oil components, sugar content and total acidity, Amer. J. Food Technol., 2011, 6, 11, 974-984, https://doi.org/10.3923/ajft.2011.974.984 . [all data]

Lima, Quintans-Junior, et al., 2011
Lima, G.M.; Quintans-Junior, L.J.; Thomazzi, S.M.; Almeida, E.M.S.A.; Melo, M.S.; Serafini, M.R.; Cavalcanti, S.C.H.; Gelain, D.P.; Santos, J.P.A.; Blank, A.F.; Alves, P.B.; Neta, P.M.O.; Lima, J.T.; Rocha, R.F.; Moreira, J.C.F.; Araujo, A.A.S., Phytochemical screening, antinociceptive and anti-inflammatory activities of Chrysopogon zizanioides essential oil, Braz. J. Pharmacognosy, 2011, 1-8. [all data]

Bi Kouame, Bedi, et al., 2010
Bi Kouame, F.P.; Bedi, G.; Koffi, A.M.; Chalchat, J.C.; Guessan, T.Y.N., Volatile constituents from leaves of Morinda morindoides (Rubiaceae): a medicinal plant from the Ivory Coast, The Open Nat. Prod. J., 2010, 3, 1, 6-9, https://doi.org/10.2174/1874848101003010006 . [all data]

Wetwiayaklung, Thavanapong, et al., 2009
Wetwiayaklung, P.; Thavanapong, N.; Charoenteeraboon, J., Chemical constituents and antimicrobial activity os essential oil and extracts of heartwood of Aquilaria crassna obtained from water distillation and supercritical fluid carbon dioxide extraction, Silpakorn U Sci. J., 2009, 3, 1, 25-33. [all data]

El-Shazily, Hafez, et al., 2004
El-Shazily, A.M.; Hafez, S.S.; Wink, M., Comparative study of the essential oils and extracts of Achillea fragrantissima (Forssk.) Sch. Bip. and Achillea santolina L. (Asteraceae) from Egypt, Pharmazie, 2004, 59, 226-230. [all data]