2-Furancarbaldehyde

Normal alkane RI, polar column, temperature ramp

Data compiled by: NIST Mass Spectrometry Data Center, William E. Wallace, director

Column type Capillary
Active phase PEG-20M
Column length (m) 50.
Carrier gas Nitrogen
Substrate
Column diameter (mm) 0.25
Phase thickness (μm) 0.25
Tstart (C) 60.
Tend (C) 180.
Heat rate (K/min) 2.
Initial hold (min)
Final hold (min)
I 1425.
ReferenceKubota, Matsujage, et al., 1996
Comment MSDC-RI

References

Kubota, Matsujage, et al., 1996
Kubota, K.; Matsujage, Y.; Sekiwa, Y.; Kobayashi, A., Identification of the characteristic volatile flavor compounds formed by cooking squid (Todarodes pacificus Steenstrup), Food Sci. Technol., 1996, 2, 3, 163-166. [all data]