trans-4-O-Caffeoyl-D-quinic acid, hexakis-TMS

Normal alkane RI, non-polar column, temperature ramp

View large format table.

Column type Active phase I Reference Comment
CapillaryDB-13240.Fuchs and Spiteller, 199630. m/0.32 mm/0.10 μm, Hydrogen, 3. K/min; Tstart: 80. C; Tend: 280. C

References

Fuchs and Spiteller, 1996
Fuchs, C.; Spiteller, G., Rapid and easy identification of isomers of cpumaroyl- and caffeoyl-D-quinic acid by gas chromatography/mass spectrometry, J. Mass Spectrom., 1996, 31, 6, 602-608, https://doi.org/10.1002/(SICI)1096-9888(199606)31:6<602::AID-JMS338>3.0.CO;2-9 . [all data]