(Z)-3-Hexen-1-ol

Normal alkane RI, polar column, temperature ramp

Data compiled by: NIST Mass Spectrometry Data Center, William E. Wallace, director

Column type CapillaryCapillaryCapillaryCapillary
Active phase VF-Wax MSDB-WaxDB-WaxDB-Wax
Column length (m) 60.60.60.30.
Carrier gas HeliumHeliumNitrogenHydrogen
Substrate
Column diameter (mm) 0.250.250.250.32
Phase thickness (μm) 0.250.25 0.50
Tstart (C) 60.35.40.30.
Tend (C) 220.240.200.190.
Heat rate (K/min) 3.6.2.3.
Initial hold (min) 5.3.10.6.
Final hold (min) 25.10.
I 1379.1395.1392.1390.
ReferenceDuarte, Dias, et al., 2010Spadone, Matthey-Doret, et al., 2006Tamura, Boonbumrung, et al., 2000Young, Gilbert, et al., 1996
Comment MSDC-RI MSDC-RI MSDC-RI MSDC-RI

References

Duarte, Dias, et al., 2010
Duarte, W.F.; Dias, D.R.; Oliveira, J.M.; Teixeira, J.A.; de Almeida e Silva, J.B.; Schwan, R.F., Characterization of different fruit wines made from cacao,cupuassu, gabiroba, jaboticaba and umbu, Food Sci. Technol., 2010, 43, 1564-1572. [all data]

Spadone, Matthey-Doret, et al., 2006
Spadone, J.-C.; Matthey-Doret, W.; Blank, I., Formation of methyl(methylthio)methyl disulfide in broccoli (Brassica oleracea (L.) var. italica) in Flavour Science: Recent Advances and Trends, Bredie, W.L.P.; Petersen, M.A., ed(s)., Elsevier, Amsterdam, 2006, 309-314. [all data]

Tamura, Boonbumrung, et al., 2000
Tamura, H.; Boonbumrung, S.; Yoshizawa, T.; Varanyanond, W., Volatile components of the essential oil in the pulp of four yellow mangoes (Mangifera indica L.) in Thailand, Food Sci. Technol. Res., 2000, 6, 1, 68-73, https://doi.org/10.3136/fstr.6.68 . [all data]

Young, Gilbert, et al., 1996
Young, H.; Gilbert, J.M.; Murray, S.H.; Ball, R.D., Causal effects of aroma compounds on Royal Gala apple flavours, J. Sci. Food Agric., 1996, 71, 3, 329-336, https://doi.org/10.1002/(SICI)1097-0010(199607)71:3<329::AID-JSFA588>3.0.CO;2-8 . [all data]