2-Methyl-2-(methyldithio)propanal

Normal alkane RI, polar column, custom temperature program

View large format table.

Column type Active phase I Reference Comment
CapillaryFFAP1570.Blank, Stampfli, et al., 1994Program: not specified

References

Blank, Stampfli, et al., 1994
Blank, I.; Stampfli, A.; Eisenreich, W., Analysis of food flavourings by gas chromatography - olfactometry in Trends of Flavour Research, Maarse, H.; van der Heij, D.G., ed(s)., 1994, 271-276. [all data]