5,10-di-epi-α-Selinene

Normal alkane RI, non-polar column, temperature ramp

Data compiled by: NIST Mass Spectrometry Data Center, William E. Wallace, director

Column type Capillary
Active phase DB-5
Column length (m) 60.
Carrier gas Helium
Substrate
Column diameter (mm) 0.32
Phase thickness (μm)
Tstart (C) 60.
Tend (C) 220.
Heat rate (K/min) 3.
Initial hold (min)
Final hold (min)
I 1534.
ReferenceEveraerts, Roisin, et al., 1993
Comment MSDC-RI

References

Everaerts, Roisin, et al., 1993
Everaerts, C.; Roisin, Y.; Le Quere, J.-L.; Bonnard, O.; Pasteels, J.M., Sesquiterpenes in the frontal gland secretion of nasute soldier termites from New Guinea, J. Chem. Ecol., 1993, 19, 12, 2865-2879, https://doi.org/10.1007/BF00980588 . [all data]