3-Methyl-2-buten-1-thiol

Normal alkane RI, non-polar column, custom temperature program

View large format table.

Column type Active phase I Reference Comment
CapillaryCP-Sil 5 CB810.Gros, Nizet, et al., 201150. m/0.32 mm/1.20 μm, Nitrogen; Program: 36 0C 20 0C/min -> 85 0C 1 0C/min -> 145 0C 3 0C/min -> 250 0C (30 min)
CapillaryCP-Sil 5 CB804.Bailly, Jerkovic, et al., 200650. m/0.32 mm/1.20 μm, Helium; Program: 36 0C 20 0C/min -> 85 0C 1 0C/min -> 1345 0C 3 0C/min -> 250 0C
CapillarySE-54821.Blank, Sen, et al., 1992Program: not specified

References

Gros, Nizet, et al., 2011
Gros, J.; Nizet, S.; Collin, S., Occurence of odorant polyfunctional thiols in the Super Alpha Tomahawk Hop cultivar. Comparison with the thiol-rich Nelson Sauvin bitter variety, J. Agric. Food Chem., 2011, 59, 16, 8853-8865, https://doi.org/10.1021/jf201294e . [all data]

Bailly, Jerkovic, et al., 2006
Bailly, S.; Jerkovic, V.; Collin, S., Identification of key-odorants in Sauternes wines, Identification of key-odorants in Sauternes wines, 5th International Terroir Congress, 2006, 4. [all data]

Blank, Sen, et al., 1992
Blank, I.; Sen, A.; Grosch, W., Potent odorants of the roasted powder and brew of Arabica coffee, Z. Lebensm. Unters Forsch., 1992, 195, 3, 239-245, https://doi.org/10.1007/BF01202802 . [all data]